{"text_format":"1","workbook":"xlsx","n_sheets":8,"sheets":["ISIAN","MENU","FORM_INPUT","FORM_BYR","DB","TBL_BYR","PO","PO_RT"],"not_rendered":{"charts":0,"images":3,"macros":1,"external_links":1,"defined_names":6,"comments":0,"pivot_tables":0},"unopened":[],"bounds":{"document_bytes":16777216,"sheet_cells":100000,"rows_first":2000,"rows_last":500,"rows_between":2000,"halvings":0,"cell_chars":16384,"cell_head_chars":4096},"cells_cut":0,"cells_raw":0,"read":"whole","date_system":"1900"}

{"sheet":"ISIAN","index":0,"n_rows":3,"n_cols":3,"rows_kept":3,"cut":false,"hidden":false,"merged":[]}
["KANTOR DESA",":","KANTOR KEPALA DESA CARUL"]
["ALAMAT",":","Jl. Raya Balai Desa Carul NO.01 Carul Bumijawa Tegal KP. 52466"]
["DESA",":","DESA CARUL"]

{"sheet":"MENU","index":1,"n_rows":9,"n_cols":3,"rows_kept":9,"cut":false,"hidden":false,"merged":[[1,2,1,11],[2,2,2,11],[3,2,3,11],[4,2,4,11],[8,2,8,11]]}
[]
[null,null,"PEMERINTAH KABUPATEN TEGAL"]
[null,null,"KECAMATAN BUMIJAWA"]
[null,null,{"$f":"ISIAN!C1","v":"KANTOR KEPALA DESA CARUL"}]
[null,null,{"$f":"ISIAN!C2","v":"Jl. Raya Balai Desa Carul NO.01 Carul Bumijawa Tegal KP. 52466"}]
[]
[]
[]
[null,null,"MENU PEMBAYARAN PAJAK"]

{"sheet":"FORM_INPUT","index":2,"n_rows":21,"n_cols":9,"rows_kept":21,"cut":false,"hidden":false,"merged":[[4,2,4,8],[10,5,10,7],[16,5,16,6],[18,5,18,6]]}
[]
[]
[]
[]
[null,null,"FORM INPUT DATA"]
[]
[]
[]
[null,null,"NO",null,":","01"]
[]
[null,null,"NOMOR WAJIB PAJAK",null,":","00.01.0005"]
[]
[null,null,"NOMOR BLOK",null,":","c.02b"]
[]
[null,null,"NAMA WAJIB PAJAK",null,":","ratmo"]
[]
[null,null,"BAKU PAJAK",null,":",75000]
[]
[null,null,"DESA, RT/RW",null,":","Carul",null,null,"02/03"]
[]
{"$rows_left_out":2}
{"sheet":"FORM_BYR","index":3,"n_rows":2511,"n_cols":15,"rows_kept":2511,"cut":false,"hidden":false,"merged":[[1,3,1,11]]}
[null,null,null,null,null,null,null,null,null,null,null,null,null,null,{"$f":"DB!B4","v":"00.01.0005"}]
[null,null,null,"FORM PEMBAYARAN PAJAK",null,null,null,null,null,null,null,null,null,null,{"$f":"DB!B5","v":0}]
[null,null,null,null,null,null,null,null,null,null,null,null,null,null,{"$f":"DB!B6","v":0}]
[null,null,null,null,null,null,null,null,null,null,null,null,null,null,{"$f":"DB!B7","v":0}]
[null,null,null,null,null,null,null,null,null,null,null,null,null,null,{"$f":"DB!B8","v":0}]
[null,null,null,"NOMOR WAJIB PAJAK",null,":","00.01.0005",null,null,null,null,null,null,null,{"$f":"DB!B9","v":0}]
[null,null,null,null,null,null,null,null,null,null,null,null,null,null,{"$f":"DB!B10","v":0}]
[null,null,null,"NAMA WAJIB PAJAK",null,":",{"$f":"IF(ISNA(VLOOKUP($G$6,DB!$B$3:$G$3998,3,FALSE)),\"\",(VLOOKUP($G$6,DB!$B$3:$G$3998,3,FALSE)))","v":"ratmo"},null,null,null,null,null,null,null,{"$f":"DB!B11","v":0}]
[null,null,null,null,null,null,null,null,null,null,null,null,null,null,{"$f":"DB!B12","v":0}]
[null,null,null,"NOMOR BLOK",null,":",{"$f":"IF(ISNA(VLOOKUP($G$6,DB!$B$3:$G$3998,2,FALSE)),\"\",(VLOOKUP($G$6,DB!$B$3:$G$3998,2,FALSE)))","v":"c.02b"},"DESA :",{"$f":"IF(ISNA(VLOOKUP($G$6,DB!$B$3:$G$3998,5,FALSE)),\"\",(VLOOKUP($G$6,DB!$B$3:$G$3998,5,FALSE)))","v":"Carul"},null,"RT/RW :",{"$f":"IF(ISNA(VLOOKUP($G$6,DB!$B$3:$G$3998,6,FALSE)),\"\",(VLOOKUP($G$6,DB!$B$3:$G$3998,6,FALSE)))","v":"02/03"},null,null,{"$f":"DB!B13","v":0}]
[null,null,null,null,null,null,null,null,null,null,null,null,null,null,{"$f":"DB!B14","v":0}]
[null,null,null,"BAKU PAJAK",null,":",{"$f":"IF(ISNA(VLOOKUP($G$6,DB!$B$3:$G$3998,4,FALSE)),\"\",(VLOOKUP($G$6,DB!$B$3:$G$3998,4,FALSE)))","v":75000},null,null,null,null,null,null,null,{"$f":"DB!B15","v":0}]
[null,null,null,null,null,null,null,null,null,null,null,null,null,null,{"$f":"DB!B16","v":0}]
[null,null,null,"TERBILANG",null,":",{"$f":"[1]!terbilang(G12)&\" Rupiah\"","v":{"$error":"#NAME?"}},null,null,null,null,null,null,null,{"$f":"DB!B17","v":0}]
[null,null,null,null,null,null,null,null,null,null,null,null,null,null,{"$f":"DB!B18","v":0}]
[null,null,null,null,null,null,null,null,null,null,null,null,null,null,{"$f":"DB!B19","v":0}]
[null,null,null,"TANGGAL BAYAR",null,":",{"$f":"TODAY()","v":"2017-05-03"},null,null,null,null,null,null,null,{"$f":"DB!B20","v":0}]
[null,null,null,null,null,null,null,null,null,null,null,null,null,null,{"$f":"DB!B21","v":0}]
[null,null,null,"JUMLAH BAYAR",null,":",75000,"Simpan dengan menekan Ctrl+X",null,null,null,null,null,null,{"$f":"DB!B22","v":0}]
[null,null,null,null,null,null,{"$f":"IF(G19=G12,\"LUNAS\",IF(G19>G12,(\"Lebih \"&G19-G12),IF(G19<G12,(\"Kurang \"&G12-G19),\"\")))","v":"LUNAS"},null,null,null,null,null,null,null,{"$f":"DB!B23","v":0}]
{"$rows_left_out":2492}
{"sheet":"DB","index":4,"n_rows":4,"n_cols":7,"rows_kept":4,"cut":false,"hidden":false,"merged":[[0,0,0,6],[1,0,1,6]]}
["DAFTAR WAJIB PAJAK"]
[{"$f":"ISIAN!C3","v":"DESA CARUL"}]
["NO","NOMOR  WAJIP PAJAK ","NOMOR BLOK","NAMA WAJIB PAJAK","BAKU PAJAK","DESA","RT/RW"]
[1,"00.01.0005","c.02b","ratmo",75000,"Carul","02/03"]

{"sheet":"TBL_BYR","index":5,"n_rows":8,"n_cols":8,"rows_kept":8,"cut":false,"hidden":false,"merged":[[3,2,3,3],[0,0,0,7],[1,0,1,7]]}
["TABEL PEMBAYARAN PBB"]
[{"$f":"ISIAN!C3","v":"DESA CARUL"}]
["JUMLAH WAJIB PAJAK YANG MASUK",null,{"$f":"COUNT(E6:E4000)","v":3}]
["TOTAL UANG YANG MASUK",null,{"$f":"SUM(E6:E4000)","v":251000}]
["TANGGAL","NOMOR  WAJIP PAJAK ","NOMOR BLOK","NAMA WAJIB PAJAK","BAKU PAJAK","DESA","RT/RW","KET"]
["2017-05-03","00.01.0005","c.02b","ratmo",75000,"Carul","02/03","LUNAS"]
["2017-06-04","00.01.0003","D.02f","Jono",80000,"suka sari","01/05","LUNAS"]
["2017-07-03","00.01.0004","c.04b","ratmo",96000,"Suka maju","02/03","LUNAS"]

{"sheet":"PO","index":6,"n_rows":36,"n_cols":7,"rows_kept":36,"cut":false,"hidden":false,"merged":[[0,0,0,4],[1,0,1,4],[34,0,34,3],[35,0,35,3]]}
["LAPORAN PEMBAYARAN HARIAN"]
[{"$f":"ISIAN!C3","v":"DESA CARUL"}]
["TANGGAL","NOMOR  WAJIP PAJAK ","NOMOR","NAMA WAJIB PAJAK","DIBAYAR"]
["BAYAR","(NOP)","BLOK","(NWP)","(Rp)"]
[{"$f":"IF(COUNTA($A$4:A4)<=COUNTIF(Tgl,$G$7),INDEX(TBL_BYR!A:A,MATCH($G$7,TBL_BYR!A:A,0)+ROW()-5),\"\")","v":"2017-05-03"},{"$f":"IF(COUNTA($A$4:A4)<=COUNTIF(Tgl,$G$7),INDEX(TBL_BYR!B:B,MATCH($G$7,TBL_BYR!A:A,0)+ROW()-5),\"\")","v":"00.01.0005"},{"$f":"IF(COUNTA($A$4:A4)<=COUNTIF(Tgl,$G$7),INDEX(TBL_BYR!C:C,MATCH($G$7,TBL_BYR!A:A,0)+ROW()-5),\"\")","v":"c.02b"},{"$f":"IF(COUNTA($A$4:A4)<=COUNTIF(Tgl,$G$7),INDEX(TBL_BYR!D:D,MATCH($G$7,TBL_BYR!A:A,0)+ROW()-5),\"\")","v":"ratmo"},{"$f":"IF(COUNTA($A$4:A4)<=COUNTIF(Tgl,$G$7),INDEX(TBL_BYR!E:E,MATCH($G$7,TBL_BYR!A:A,0)+ROW()-5),\"\")","v":75000},null,"MASUKAN TANGGAL"]
[{"$f":"IF(COUNTA($A$4:A5)<=COUNTIF(Tgl,$G$7),INDEX(TBL_BYR!A:A,MATCH($G$7,TBL_BYR!A:A,0)+ROW()-5),\"\")","v":""},{"$f":"IF(COUNTA($A$4:A5)<=COUNTIF(Tgl,$G$7),INDEX(TBL_BYR!B:B,MATCH($G$7,TBL_BYR!A:A,0)+ROW()-5),\"\")","v":""},{"$f":"IF(COUNTA($A$4:A5)<=COUNTIF(Tgl,$G$7),INDEX(TBL_BYR!C:C,MATCH($G$7,TBL_BYR!A:A,0)+ROW()-5),\"\")","v":""},{"$f":"IF(COUNTA($A$4:A5)<=COUNTIF(Tgl,$G$7),INDEX(TBL_BYR!D:D,MATCH($G$7,TBL_BYR!A:A,0)+ROW()-5),\"\")","v":""},{"$f":"IF(COUNTA($A$4:A5)<=COUNTIF(Tgl,$G$7),INDEX(TBL_BYR!E:E,MATCH($G$7,TBL_BYR!A:A,0)+ROW()-5),\"\")","v":""},null,"YANG AKAN DI CETAK"]
[{"$f":"IF(COUNTA($A$4:A6)<=COUNTIF(Tgl,$G$7),INDEX(TBL_BYR!A:A,MATCH($G$7,TBL_BYR!A:A,0)+ROW()-5),\"\")","v":""},{"$f":"IF(COUNTA($A$4:A6)<=COUNTIF(Tgl,$G$7),INDEX(TBL_BYR!B:B,MATCH($G$7,TBL_BYR!A:A,0)+ROW()-5),\"\")","v":""},{"$f":"IF(COUNTA($A$4:A6)<=COUNTIF(Tgl,$G$7),INDEX(TBL_BYR!C:C,MATCH($G$7,TBL_BYR!A:A,0)+ROW()-5),\"\")","v":""},{"$f":"IF(COUNTA($A$4:A6)<=COUNTIF(Tgl,$G$7),INDEX(TBL_BYR!D:D,MATCH($G$7,TBL_BYR!A:A,0)+ROW()-5),\"\")","v":""},{"$f":"IF(COUNTA($A$4:A6)<=COUNTIF(Tgl,$G$7),INDEX(TBL_BYR!E:E,MATCH($G$7,TBL_BYR!A:A,0)+ROW()-5),\"\")","v":""},null,"2017-05-03"]
[{"$f":"IF(COUNTA($A$4:A7)<=COUNTIF(Tgl,$G$7),INDEX(TBL_BYR!A:A,MATCH($G$7,TBL_BYR!A:A,0)+ROW()-5),\"\")","v":""},{"$f":"IF(COUNTA($A$4:A7)<=COUNTIF(Tgl,$G$7),INDEX(TBL_BYR!B:B,MATCH($G$7,TBL_BYR!A:A,0)+ROW()-5),\"\")","v":""},{"$f":"IF(COUNTA($A$4:A7)<=COUNTIF(Tgl,$G$7),INDEX(TBL_BYR!C:C,MATCH($G$7,TBL_BYR!A:A,0)+ROW()-5),\"\")","v":""},{"$f":"IF(COUNTA($A$4:A7)<=COUNTIF(Tgl,$G$7),INDEX(TBL_BYR!D:D,MATCH($G$7,TBL_BYR!A:A,0)+ROW()-5),\"\")","v":""},{"$f":"IF(COUNTA($A$4:A7)<=COUNTIF(Tgl,$G$7),INDEX(TBL_BYR!E:E,MATCH($G$7,TBL_BYR!A:A,0)+ROW()-5),\"\")","v":""},null,"dd/mm/yy"]
[{"$f":"IF(COUNTA($A$4:A8)<=COUNTIF(Tgl,$G$7),INDEX(TBL_BYR!A:A,MATCH($G$7,TBL_BYR!A:A,0)+ROW()-5),\"\")","v":""},{"$f":"IF(COUNTA($A$4:A8)<=COUNTIF(Tgl,$G$7),INDEX(TBL_BYR!B:B,MATCH($G$7,TBL_BYR!A:A,0)+ROW()-5),\"\")","v":""},{"$f":"IF(COUNTA($A$4:A8)<=COUNTIF(Tgl,$G$7),INDEX(TBL_BYR!C:C,MATCH($G$7,TBL_BYR!A:A,0)+ROW()-5),\"\")","v":""},{"$f":"IF(COUNTA($A$4:A8)<=COUNTIF(Tgl,$G$7),INDEX(TBL_BYR!D:D,MATCH($G$7,TBL_BYR!A:A,0)+ROW()-5),\"\")","v":""},{"$f":"IF(COUNTA($A$4:A8)<=COUNTIF(Tgl,$G$7),INDEX(TBL_BYR!E:E,MATCH($G$7,TBL_BYR!A:A,0)+ROW()-5),\"\")","v":""}]
[{"$f":"IF(COUNTA($A$4:A9)<=COUNTIF(Tgl,$G$7),INDEX(TBL_BYR!A:A,MATCH($G$7,TBL_BYR!A:A,0)+ROW()-5),\"\")","v":""},{"$f":"IF(COUNTA($A$4:A9)<=COUNTIF(Tgl,$G$7),INDEX(TBL_BYR!B:B,MATCH($G$7,TBL_BYR!A:A,0)+ROW()-5),\"\")","v":""},{"$f":"IF(COUNTA($A$4:A9)<=COUNTIF(Tgl,$G$7),INDEX(TBL_BYR!C:C,MATCH($G$7,TBL_BYR!A:A,0)+ROW()-5),\"\")","v":""},{"$f":"IF(COUNTA($A$4:A9)<=COUNTIF(Tgl,$G$7),INDEX(TBL_BYR!D:D,MATCH($G$7,TBL_BYR!A:A,0)+ROW()-5),\"\")","v":""},{"$f":"IF(COUNTA($A$4:A9)<=COUNTIF(Tgl,$G$7),INDEX(TBL_BYR!E:E,MATCH($G$7,TBL_BYR!A:A,0)+ROW()-5),\"\")","v":""}]
[{"$f":"IF(COUNTA($A$4:A10)<=COUNTIF(Tgl,$G$7),INDEX(TBL_BYR!A:A,MATCH($G$7,TBL_BYR!A:A,0)+ROW()-5),\"\")","v":""},{"$f":"IF(COUNTA($A$4:A10)<=COUNTIF(Tgl,$G$7),INDEX(TBL_BYR!B:B,MATCH($G$7,TBL_BYR!A:A,0)+ROW()-5),\"\")","v":""},{"$f":"IF(COUNTA($A$4:A10)<=COUNTIF(Tgl,$G$7),INDEX(TBL_BYR!C:C,MATCH($G$7,TBL_BYR!A:A,0)+ROW()-5),\"\")","v":""},{"$f":"IF(COUNTA($A$4:A10)<=COUNTIF(Tgl,$G$7),INDEX(TBL_BYR!D:D,MATCH($G$7,TBL_BYR!A:A,0)+ROW()-5),\"\")","v":""},{"$f":"IF(COUNTA($A$4:A10)<=COUNTIF(Tgl,$G$7),INDEX(TBL_BYR!E:E,MATCH($G$7,TBL_BYR!A:A,0)+ROW()-5),\"\")","v":""}]
[{"$f":"IF(COUNTA($A$4:A11)<=COUNTIF(Tgl,$G$7),INDEX(TBL_BYR!A:A,MATCH($G$7,TBL_BYR!A:A,0)+ROW()-5),\"\")","v":""},{"$f":"IF(COUNTA($A$4:A11)<=COUNTIF(Tgl,$G$7),INDEX(TBL_BYR!B:B,MATCH($G$7,TBL_BYR!A:A,0)+ROW()-5),\"\")","v":""},{"$f":"IF(COUNTA($A$4:A11)<=COUNTIF(Tgl,$G$7),INDEX(TBL_BYR!C:C,MATCH($G$7,TBL_BYR!A:A,0)+ROW()-5),\"\")","v":""},{"$f":"IF(COUNTA($A$4:A11)<=COUNTIF(Tgl,$G$7),INDEX(TBL_BYR!D:D,MATCH($G$7,TBL_BYR!A:A,0)+ROW()-5),\"\")","v":""},{"$f":"IF(COUNTA($A$4:A11)<=COUNTIF(Tgl,$G$7),INDEX(TBL_BYR!E:E,MATCH($G$7,TBL_BYR!A:A,0)+ROW()-5),\"\")","v":""}]
[{"$f":"IF(COUNTA($A$4:A12)<=COUNTIF(Tgl,$G$7),INDEX(TBL_BYR!A:A,MATCH($G$7,TBL_BYR!A:A,0)+ROW()-5),\"\")","v":""},{"$f":"IF(COUNTA($A$4:A12)<=COUNTIF(Tgl,$G$7),INDEX(TBL_BYR!B:B,MATCH($G$7,TBL_BYR!A:A,0)+ROW()-5),\"\")","v":""},{"$f":"IF(COUNTA($A$4:A12)<=COUNTIF(Tgl,$G$7),INDEX(TBL_BYR!C:C,MATCH($G$7,TBL_BYR!A:A,0)+ROW()-5),\"\")","v":""},{"$f":"IF(COUNTA($A$4:A12)<=COUNTIF(Tgl,$G$7),INDEX(TBL_BYR!D:D,MATCH($G$7,TBL_BYR!A:A,0)+ROW()-5),\"\")","v":""},{"$f":"IF(COUNTA($A$4:A12)<=COUNTIF(Tgl,$G$7),INDEX(TBL_BYR!E:E,MATCH($G$7,TBL_BYR!A:A,0)+ROW()-5),\"\")","v":""}]
[{"$f":"IF(COUNTA($A$4:A13)<=COUNTIF(Tgl,$G$7),INDEX(TBL_BYR!A:A,MATCH($G$7,TBL_BYR!A:A,0)+ROW()-5),\"\")","v":""},{"$f":"IF(COUNTA($A$4:A13)<=COUNTIF(Tgl,$G$7),INDEX(TBL_BYR!B:B,MATCH($G$7,TBL_BYR!A:A,0)+ROW()-5),\"\")","v":""},{"$f":"IF(COUNTA($A$4:A13)<=COUNTIF(Tgl,$G$7),INDEX(TBL_BYR!C:C,MATCH($G$7,TBL_BYR!A:A,0)+ROW()-5),\"\")","v":""},{"$f":"IF(COUNTA($A$4:A13)<=COUNTIF(Tgl,$G$7),INDEX(TBL_BYR!D:D,MATCH($G$7,TBL_BYR!A:A,0)+ROW()-5),\"\")","v":""},{"$f":"IF(COUNTA($A$4:A13)<=COUNTIF(Tgl,$G$7),INDEX(TBL_BYR!E:E,MATCH($G$7,TBL_BYR!A:A,0)+ROW()-5),\"\")","v":""}]
[{"$f":"IF(COUNTA($A$4:A14)<=COUNTIF(Tgl,$G$7),INDEX(TBL_BYR!A:A,MATCH($G$7,TBL_BYR!A:A,0)+ROW()-5),\"\")","v":""},{"$f":"IF(COUNTA($A$4:A14)<=COUNTIF(Tgl,$G$7),INDEX(TBL_BYR!B:B,MATCH($G$7,TBL_BYR!A:A,0)+ROW()-5),\"\")","v":""},{"$f":"IF(COUNTA($A$4:A14)<=COUNTIF(Tgl,$G$7),INDEX(TBL_BYR!C:C,MATCH($G$7,TBL_BYR!A:A,0)+ROW()-5),\"\")","v":""},{"$f":"IF(COUNTA($A$4:A14)<=COUNTIF(Tgl,$G$7),INDEX(TBL_BYR!D:D,MATCH($G$7,TBL_BYR!A:A,0)+ROW()-5),\"\")","v":""},{"$f":"IF(COUNTA($A$4:A14)<=COUNTIF(Tgl,$G$7),INDEX(TBL_BYR!E:E,MATCH($G$7,TBL_BYR!A:A,0)+ROW()-5),\"\")","v":""}]
[{"$f":"IF(COUNTA($A$4:A15)<=COUNTIF(Tgl,$G$7),INDEX(TBL_BYR!A:A,MATCH($G$7,TBL_BYR!A:A,0)+ROW()-5),\"\")","v":""},{"$f":"IF(COUNTA($A$4:A15)<=COUNTIF(Tgl,$G$7),INDEX(TBL_BYR!B:B,MATCH($G$7,TBL_BYR!A:A,0)+ROW()-5),\"\")","v":""},{"$f":"IF(COUNTA($A$4:A15)<=COUNTIF(Tgl,$G$7),INDEX(TBL_BYR!C:C,MATCH($G$7,TBL_BYR!A:A,0)+ROW()-5),\"\")","v":""},{"$f":"IF(COUNTA($A$4:A15)<=COUNTIF(Tgl,$G$7),INDEX(TBL_BYR!D:D,MATCH($G$7,TBL_BYR!A:A,0)+ROW()-5),\"\")","v":""},{"$f":"IF(COUNTA($A$4:A15)<=COUNTIF(Tgl,$G$7),INDEX(TBL_BYR!E:E,MATCH($G$7,TBL_BYR!A:A,0)+ROW()-5),\"\")","v":""}]
[{"$f":"IF(COUNTA($A$4:A16)<=COUNTIF(Tgl,$G$7),INDEX(TBL_BYR!A:A,MATCH($G$7,TBL_BYR!A:A,0)+ROW()-5),\"\")","v":""},{"$f":"IF(COUNTA($A$4:A16)<=COUNTIF(Tgl,$G$7),INDEX(TBL_BYR!B:B,MATCH($G$7,TBL_BYR!A:A,0)+ROW()-5),\"\")","v":""},{"$f":"IF(COUNTA($A$4:A16)<=COUNTIF(Tgl,$G$7),INDEX(TBL_BYR!C:C,MATCH($G$7,TBL_BYR!A:A,0)+ROW()-5),\"\")","v":""},{"$f":"IF(COUNTA($A$4:A16)<=COUNTIF(Tgl,$G$7),INDEX(TBL_BYR!D:D,MATCH($G$7,TBL_BYR!A:A,0)+ROW()-5),\"\")","v":""},{"$f":"IF(COUNTA($A$4:A16)<=COUNTIF(Tgl,$G$7),INDEX(TBL_BYR!E:E,MATCH($G$7,TBL_BYR!A:A,0)+ROW()-5),\"\")","v":""}]
[{"$f":"IF(COUNTA($A$4:A17)<=COUNTIF(Tgl,$G$7),INDEX(TBL_BYR!A:A,MATCH($G$7,TBL_BYR!A:A,0)+ROW()-5),\"\")","v":""},{"$f":"IF(COUNTA($A$4:A17)<=COUNTIF(Tgl,$G$7),INDEX(TBL_BYR!B:B,MATCH($G$7,TBL_BYR!A:A,0)+ROW()-5),\"\")","v":""},{"$f":"IF(COUNTA($A$4:A17)<=COUNTIF(Tgl,$G$7),INDEX(TBL_BYR!C:C,MATCH($G$7,TBL_BYR!A:A,0)+ROW()-5),\"\")","v":""},{"$f":"IF(COUNTA($A$4:A17)<=COUNTIF(Tgl,$G$7),INDEX(TBL_BYR!D:D,MATCH($G$7,TBL_BYR!A:A,0)+ROW()-5),\"\")","v":""},{"$f":"IF(COUNTA($A$4:A17)<=COUNTIF(Tgl,$G$7),INDEX(TBL_BYR!E:E,MATCH($G$7,TBL_BYR!A:A,0)+ROW()-5),\"\")","v":""}]
[{"$f":"IF(COUNTA($A$4:A18)<=COUNTIF(Tgl,$G$7),INDEX(TBL_BYR!A:A,MATCH($G$7,TBL_BYR!A:A,0)+ROW()-5),\"\")","v":""},{"$f":"IF(COUNTA($A$4:A18)<=COUNTIF(Tgl,$G$7),INDEX(TBL_BYR!B:B,MATCH($G$7,TBL_BYR!A:A,0)+ROW()-5),\"\")","v":""},{"$f":"IF(COUNTA($A$4:A18)<=COUNTIF(Tgl,$G$7),INDEX(TBL_BYR!C:C,MATCH($G$7,TBL_BYR!A:A,0)+ROW()-5),\"\")","v":""},{"$f":"IF(COUNTA($A$4:A18)<=COUNTIF(Tgl,$G$7),INDEX(TBL_BYR!D:D,MATCH($G$7,TBL_BYR!A:A,0)+ROW()-5),\"\")","v":""},{"$f":"IF(COUNTA($A$4:A18)<=COUNTIF(Tgl,$G$7),INDEX(TBL_BYR!E:E,MATCH($G$7,TBL_BYR!A:A,0)+ROW()-5),\"\")","v":""}]
[{"$f":"IF(COUNTA($A$4:A19)<=COUNTIF(Tgl,$G$7),INDEX(TBL_BYR!A:A,MATCH($G$7,TBL_BYR!A:A,0)+ROW()-5),\"\")","v":""},{"$f":"IF(COUNTA($A$4:A19)<=COUNTIF(Tgl,$G$7),INDEX(TBL_BYR!B:B,MATCH($G$7,TBL_BYR!A:A,0)+ROW()-5),\"\")","v":""},{"$f":"IF(COUNTA($A$4:A19)<=COUNTIF(Tgl,$G$7),INDEX(TBL_BYR!C:C,MATCH($G$7,TBL_BYR!A:A,0)+ROW()-5),\"\")","v":""},{"$f":"IF(COUNTA($A$4:A19)<=COUNTIF(Tgl,$G$7),INDEX(TBL_BYR!D:D,MATCH($G$7,TBL_BYR!A:A,0)+ROW()-5),\"\")","v":""},{"$f":"IF(COUNTA($A$4:A19)<=COUNTIF(Tgl,$G$7),INDEX(TBL_BYR!E:E,MATCH($G$7,TBL_BYR!A:A,0)+ROW()-5),\"\")","v":""}]
{"$rows_left_out":17}
{"sheet":"PO_RT","index":7,"n_rows":36,"n_cols":7,"rows_kept":36,"cut":false,"hidden":false,"merged":[[0,0,0,4],[1,0,1,4],[34,0,34,3],[35,0,35,3]]}
["LAPORAN PEMBAYARAN HARIAN"]
[{"$f":"ISIAN!C3","v":"DESA CARUL"}]
["DATA per","NOMOR  WAJIP PAJAK ","NOMOR","NAMA WAJIB PAJAK","DIBAYAR"]
["RT/RW","(NOP)","BLOK","(NWP)","(Rp)"]
[{"$f":"IF(COUNTA($A$4:A4)<=COUNTIF(RT,$G$7),INDEX(TBL_BYR!A:A,MATCH($G$7,TBL_BYR!G:G,0)+ROW()-5),\"\")","v":"2017-05-03"},{"$f":"IF(COUNTA($A$4:A4)<=COUNTIF(RT,$G$7),INDEX(TBL_BYR!B:B,MATCH($G$7,TBL_BYR!G:G,0)+ROW()-5),\"\")","v":"00.01.0005"},{"$f":"IF(COUNTA($A$4:A4)<=COUNTIF(RT,$G$7),INDEX(TBL_BYR!C:C,MATCH($G$7,TBL_BYR!G:G,0)+ROW()-5),\"\")","v":"c.02b"},{"$f":"IF(COUNTA($A$4:A4)<=COUNTIF(RT,$G$7),INDEX(TBL_BYR!D:D,MATCH($G$7,TBL_BYR!G:G,0)+ROW()-5),\"\")","v":"ratmo"},{"$f":"IF(COUNTA($A$4:A4)<=COUNTIF(RT,$G$7),INDEX(TBL_BYR!E:E,MATCH($G$7,TBL_BYR!G:G,0)+ROW()-5),\"\")","v":75000},null,"MASUKAN RT/RW"]
[{"$f":"IF(COUNTA($A$4:A5)<=COUNTIF(RT,$G$7),INDEX(TBL_BYR!A:A,MATCH($G$7,TBL_BYR!G:G,0)+ROW()-5),\"\")","v":"2017-06-04"},{"$f":"IF(COUNTA($A$4:A5)<=COUNTIF(RT,$G$7),INDEX(TBL_BYR!B:B,MATCH($G$7,TBL_BYR!G:G,0)+ROW()-5),\"\")","v":"00.01.0003"},{"$f":"IF(COUNTA($A$4:A5)<=COUNTIF(RT,$G$7),INDEX(TBL_BYR!C:C,MATCH($G$7,TBL_BYR!G:G,0)+ROW()-5),\"\")","v":"D.02f"},{"$f":"IF(COUNTA($A$4:A5)<=COUNTIF(RT,$G$7),INDEX(TBL_BYR!D:D,MATCH($G$7,TBL_BYR!G:G,0)+ROW()-5),\"\")","v":"Jono"},{"$f":"IF(COUNTA($A$4:A5)<=COUNTIF(RT,$G$7),INDEX(TBL_BYR!E:E,MATCH($G$7,TBL_BYR!G:G,0)+ROW()-5),\"\")","v":80000},null,"YANG AKAN DI CETAK"]
[{"$f":"IF(COUNTA($A$4:A6)<=COUNTIF(RT,$G$7),INDEX(TBL_BYR!A:A,MATCH($G$7,TBL_BYR!G:G,0)+ROW()-5),\"\")","v":""},{"$f":"IF(COUNTA($A$4:A6)<=COUNTIF(RT,$G$7),INDEX(TBL_BYR!B:B,MATCH($G$7,TBL_BYR!G:G,0)+ROW()-5),\"\")","v":""},{"$f":"IF(COUNTA($A$4:A6)<=COUNTIF(RT,$G$7),INDEX(TBL_BYR!C:C,MATCH($G$7,TBL_BYR!G:G,0)+ROW()-5),\"\")","v":""},{"$f":"IF(COUNTA($A$4:A6)<=COUNTIF(RT,$G$7),INDEX(TBL_BYR!D:D,MATCH($G$7,TBL_BYR!G:G,0)+ROW()-5),\"\")","v":""},{"$f":"IF(COUNTA($A$4:A6)<=COUNTIF(RT,$G$7),INDEX(TBL_BYR!E:E,MATCH($G$7,TBL_BYR!G:G,0)+ROW()-5),\"\")","v":""},null,"02/03"]
[{"$f":"IF(COUNTA($A$4:A7)<=COUNTIF(RT,$G$7),INDEX(TBL_BYR!A:A,MATCH($G$7,TBL_BYR!G:G,0)+ROW()-5),\"\")","v":""},{"$f":"IF(COUNTA($A$4:A7)<=COUNTIF(RT,$G$7),INDEX(TBL_BYR!B:B,MATCH($G$7,TBL_BYR!G:G,0)+ROW()-5),\"\")","v":""},{"$f":"IF(COUNTA($A$4:A7)<=COUNTIF(RT,$G$7),INDEX(TBL_BYR!C:C,MATCH($G$7,TBL_BYR!G:G,0)+ROW()-5),\"\")","v":""},{"$f":"IF(COUNTA($A$4:A7)<=COUNTIF(RT,$G$7),INDEX(TBL_BYR!D:D,MATCH($G$7,TBL_BYR!G:G,0)+ROW()-5),\"\")","v":""},{"$f":"IF(COUNTA($A$4:A7)<=COUNTIF(RT,$G$7),INDEX(TBL_BYR!E:E,MATCH($G$7,TBL_BYR!G:G,0)+ROW()-5),\"\")","v":""}]
[{"$f":"IF(COUNTA($A$4:A8)<=COUNTIF(RT,$G$7),INDEX(TBL_BYR!A:A,MATCH($G$7,TBL_BYR!G:G,0)+ROW()-5),\"\")","v":""},{"$f":"IF(COUNTA($A$4:A8)<=COUNTIF(RT,$G$7),INDEX(TBL_BYR!B:B,MATCH($G$7,TBL_BYR!G:G,0)+ROW()-5),\"\")","v":""},{"$f":"IF(COUNTA($A$4:A8)<=COUNTIF(RT,$G$7),INDEX(TBL_BYR!C:C,MATCH($G$7,TBL_BYR!G:G,0)+ROW()-5),\"\")","v":""},{"$f":"IF(COUNTA($A$4:A8)<=COUNTIF(RT,$G$7),INDEX(TBL_BYR!D:D,MATCH($G$7,TBL_BYR!G:G,0)+ROW()-5),\"\")","v":""},{"$f":"IF(COUNTA($A$4:A8)<=COUNTIF(RT,$G$7),INDEX(TBL_BYR!E:E,MATCH($G$7,TBL_BYR!G:G,0)+ROW()-5),\"\")","v":""}]
[{"$f":"IF(COUNTA($A$4:A9)<=COUNTIF(RT,$G$7),INDEX(TBL_BYR!A:A,MATCH($G$7,TBL_BYR!G:G,0)+ROW()-5),\"\")","v":""},{"$f":"IF(COUNTA($A$4:A9)<=COUNTIF(RT,$G$7),INDEX(TBL_BYR!B:B,MATCH($G$7,TBL_BYR!G:G,0)+ROW()-5),\"\")","v":""},{"$f":"IF(COUNTA($A$4:A9)<=COUNTIF(RT,$G$7),INDEX(TBL_BYR!C:C,MATCH($G$7,TBL_BYR!G:G,0)+ROW()-5),\"\")","v":""},{"$f":"IF(COUNTA($A$4:A9)<=COUNTIF(RT,$G$7),INDEX(TBL_BYR!D:D,MATCH($G$7,TBL_BYR!G:G,0)+ROW()-5),\"\")","v":""},{"$f":"IF(COUNTA($A$4:A9)<=COUNTIF(RT,$G$7),INDEX(TBL_BYR!E:E,MATCH($G$7,TBL_BYR!G:G,0)+ROW()-5),\"\")","v":""}]
[{"$f":"IF(COUNTA($A$4:A10)<=COUNTIF(RT,$G$7),INDEX(TBL_BYR!A:A,MATCH($G$7,TBL_BYR!G:G,0)+ROW()-5),\"\")","v":""},{"$f":"IF(COUNTA($A$4:A10)<=COUNTIF(RT,$G$7),INDEX(TBL_BYR!B:B,MATCH($G$7,TBL_BYR!G:G,0)+ROW()-5),\"\")","v":""},{"$f":"IF(COUNTA($A$4:A10)<=COUNTIF(RT,$G$7),INDEX(TBL_BYR!C:C,MATCH($G$7,TBL_BYR!G:G,0)+ROW()-5),\"\")","v":""},{"$f":"IF(COUNTA($A$4:A10)<=COUNTIF(RT,$G$7),INDEX(TBL_BYR!D:D,MATCH($G$7,TBL_BYR!G:G,0)+ROW()-5),\"\")","v":""},{"$f":"IF(COUNTA($A$4:A10)<=COUNTIF(RT,$G$7),INDEX(TBL_BYR!E:E,MATCH($G$7,TBL_BYR!G:G,0)+ROW()-5),\"\")","v":""}]
[{"$f":"IF(COUNTA($A$4:A11)<=COUNTIF(RT,$G$7),INDEX(TBL_BYR!A:A,MATCH($G$7,TBL_BYR!G:G,0)+ROW()-5),\"\")","v":""},{"$f":"IF(COUNTA($A$4:A11)<=COUNTIF(RT,$G$7),INDEX(TBL_BYR!B:B,MATCH($G$7,TBL_BYR!G:G,0)+ROW()-5),\"\")","v":""},{"$f":"IF(COUNTA($A$4:A11)<=COUNTIF(RT,$G$7),INDEX(TBL_BYR!C:C,MATCH($G$7,TBL_BYR!G:G,0)+ROW()-5),\"\")","v":""},{"$f":"IF(COUNTA($A$4:A11)<=COUNTIF(RT,$G$7),INDEX(TBL_BYR!D:D,MATCH($G$7,TBL_BYR!G:G,0)+ROW()-5),\"\")","v":""},{"$f":"IF(COUNTA($A$4:A11)<=COUNTIF(RT,$G$7),INDEX(TBL_BYR!E:E,MATCH($G$7,TBL_BYR!G:G,0)+ROW()-5),\"\")","v":""}]
[{"$f":"IF(COUNTA($A$4:A12)<=COUNTIF(RT,$G$7),INDEX(TBL_BYR!A:A,MATCH($G$7,TBL_BYR!G:G,0)+ROW()-5),\"\")","v":""},{"$f":"IF(COUNTA($A$4:A12)<=COUNTIF(RT,$G$7),INDEX(TBL_BYR!B:B,MATCH($G$7,TBL_BYR!G:G,0)+ROW()-5),\"\")","v":""},{"$f":"IF(COUNTA($A$4:A12)<=COUNTIF(RT,$G$7),INDEX(TBL_BYR!C:C,MATCH($G$7,TBL_BYR!G:G,0)+ROW()-5),\"\")","v":""},{"$f":"IF(COUNTA($A$4:A12)<=COUNTIF(RT,$G$7),INDEX(TBL_BYR!D:D,MATCH($G$7,TBL_BYR!G:G,0)+ROW()-5),\"\")","v":""},{"$f":"IF(COUNTA($A$4:A12)<=COUNTIF(RT,$G$7),INDEX(TBL_BYR!E:E,MATCH($G$7,TBL_BYR!G:G,0)+ROW()-5),\"\")","v":""}]
[{"$f":"IF(COUNTA($A$4:A13)<=COUNTIF(RT,$G$7),INDEX(TBL_BYR!A:A,MATCH($G$7,TBL_BYR!G:G,0)+ROW()-5),\"\")","v":""},{"$f":"IF(COUNTA($A$4:A13)<=COUNTIF(RT,$G$7),INDEX(TBL_BYR!B:B,MATCH($G$7,TBL_BYR!G:G,0)+ROW()-5),\"\")","v":""},{"$f":"IF(COUNTA($A$4:A13)<=COUNTIF(RT,$G$7),INDEX(TBL_BYR!C:C,MATCH($G$7,TBL_BYR!G:G,0)+ROW()-5),\"\")","v":""},{"$f":"IF(COUNTA($A$4:A13)<=COUNTIF(RT,$G$7),INDEX(TBL_BYR!D:D,MATCH($G$7,TBL_BYR!G:G,0)+ROW()-5),\"\")","v":""},{"$f":"IF(COUNTA($A$4:A13)<=COUNTIF(RT,$G$7),INDEX(TBL_BYR!E:E,MATCH($G$7,TBL_BYR!G:G,0)+ROW()-5),\"\")","v":""}]
[{"$f":"IF(COUNTA($A$4:A14)<=COUNTIF(RT,$G$7),INDEX(TBL_BYR!A:A,MATCH($G$7,TBL_BYR!G:G,0)+ROW()-5),\"\")","v":""},{"$f":"IF(COUNTA($A$4:A14)<=COUNTIF(RT,$G$7),INDEX(TBL_BYR!B:B,MATCH($G$7,TBL_BYR!G:G,0)+ROW()-5),\"\")","v":""},{"$f":"IF(COUNTA($A$4:A14)<=COUNTIF(RT,$G$7),INDEX(TBL_BYR!C:C,MATCH($G$7,TBL_BYR!G:G,0)+ROW()-5),\"\")","v":""},{"$f":"IF(COUNTA($A$4:A14)<=COUNTIF(RT,$G$7),INDEX(TBL_BYR!D:D,MATCH($G$7,TBL_BYR!G:G,0)+ROW()-5),\"\")","v":""},{"$f":"IF(COUNTA($A$4:A14)<=COUNTIF(RT,$G$7),INDEX(TBL_BYR!E:E,MATCH($G$7,TBL_BYR!G:G,0)+ROW()-5),\"\")","v":""}]
[{"$f":"IF(COUNTA($A$4:A15)<=COUNTIF(RT,$G$7),INDEX(TBL_BYR!A:A,MATCH($G$7,TBL_BYR!G:G,0)+ROW()-5),\"\")","v":""},{"$f":"IF(COUNTA($A$4:A15)<=COUNTIF(RT,$G$7),INDEX(TBL_BYR!B:B,MATCH($G$7,TBL_BYR!G:G,0)+ROW()-5),\"\")","v":""},{"$f":"IF(COUNTA($A$4:A15)<=COUNTIF(RT,$G$7),INDEX(TBL_BYR!C:C,MATCH($G$7,TBL_BYR!G:G,0)+ROW()-5),\"\")","v":""},{"$f":"IF(COUNTA($A$4:A15)<=COUNTIF(RT,$G$7),INDEX(TBL_BYR!D:D,MATCH($G$7,TBL_BYR!G:G,0)+ROW()-5),\"\")","v":""},{"$f":"IF(COUNTA($A$4:A15)<=COUNTIF(RT,$G$7),INDEX(TBL_BYR!E:E,MATCH($G$7,TBL_BYR!G:G,0)+ROW()-5),\"\")","v":""}]
[{"$f":"IF(COUNTA($A$4:A16)<=COUNTIF(RT,$G$7),INDEX(TBL_BYR!A:A,MATCH($G$7,TBL_BYR!G:G,0)+ROW()-5),\"\")","v":""},{"$f":"IF(COUNTA($A$4:A16)<=COUNTIF(RT,$G$7),INDEX(TBL_BYR!B:B,MATCH($G$7,TBL_BYR!G:G,0)+ROW()-5),\"\")","v":""},{"$f":"IF(COUNTA($A$4:A16)<=COUNTIF(RT,$G$7),INDEX(TBL_BYR!C:C,MATCH($G$7,TBL_BYR!G:G,0)+ROW()-5),\"\")","v":""},{"$f":"IF(COUNTA($A$4:A16)<=COUNTIF(RT,$G$7),INDEX(TBL_BYR!D:D,MATCH($G$7,TBL_BYR!G:G,0)+ROW()-5),\"\")","v":""},{"$f":"IF(COUNTA($A$4:A16)<=COUNTIF(RT,$G$7),INDEX(TBL_BYR!E:E,MATCH($G$7,TBL_BYR!G:G,0)+ROW()-5),\"\")","v":""}]
[{"$f":"IF(COUNTA($A$4:A17)<=COUNTIF(RT,$G$7),INDEX(TBL_BYR!A:A,MATCH($G$7,TBL_BYR!G:G,0)+ROW()-5),\"\")","v":""},{"$f":"IF(COUNTA($A$4:A17)<=COUNTIF(RT,$G$7),INDEX(TBL_BYR!B:B,MATCH($G$7,TBL_BYR!G:G,0)+ROW()-5),\"\")","v":""},{"$f":"IF(COUNTA($A$4:A17)<=COUNTIF(RT,$G$7),INDEX(TBL_BYR!C:C,MATCH($G$7,TBL_BYR!G:G,0)+ROW()-5),\"\")","v":""},{"$f":"IF(COUNTA($A$4:A17)<=COUNTIF(RT,$G$7),INDEX(TBL_BYR!D:D,MATCH($G$7,TBL_BYR!G:G,0)+ROW()-5),\"\")","v":""},{"$f":"IF(COUNTA($A$4:A17)<=COUNTIF(RT,$G$7),INDEX(TBL_BYR!E:E,MATCH($G$7,TBL_BYR!G:G,0)+ROW()-5),\"\")","v":""}]
[{"$f":"IF(COUNTA($A$4:A18)<=COUNTIF(RT,$G$7),INDEX(TBL_BYR!A:A,MATCH($G$7,TBL_BYR!G:G,0)+ROW()-5),\"\")","v":""},{"$f":"IF(COUNTA($A$4:A18)<=COUNTIF(RT,$G$7),INDEX(TBL_BYR!B:B,MATCH($G$7,TBL_BYR!G:G,0)+ROW()-5),\"\")","v":""},{"$f":"IF(COUNTA($A$4:A18)<=COUNTIF(RT,$G$7),INDEX(TBL_BYR!C:C,MATCH($G$7,TBL_BYR!G:G,0)+ROW()-5),\"\")","v":""},{"$f":"IF(COUNTA($A$4:A18)<=COUNTIF(RT,$G$7),INDEX(TBL_BYR!D:D,MATCH($G$7,TBL_BYR!G:G,0)+ROW()-5),\"\")","v":""},{"$f":"IF(COUNTA($A$4:A18)<=COUNTIF(RT,$G$7),INDEX(TBL_BYR!E:E,MATCH($G$7,TBL_BYR!G:G,0)+ROW()-5),\"\")","v":""}]
[{"$f":"IF(COUNTA($A$4:A19)<=COUNTIF(RT,$G$7),INDEX(TBL_BYR!A:A,MATCH($G$7,TBL_BYR!G:G,0)+ROW()-5),\"\")","v":""},{"$f":"IF(COUNTA($A$4:A19)<=COUNTIF(RT,$G$7),INDEX(TBL_BYR!B:B,MATCH($G$7,TBL_BYR!G:G,0)+ROW()-5),\"\")","v":""},{"$f":"IF(COUNTA($A$4:A19)<=COUNTIF(RT,$G$7),INDEX(TBL_BYR!C:C,MATCH($G$7,TBL_BYR!G:G,0)+ROW()-5),\"\")","v":""},{"$f":"IF(COUNTA($A$4:A19)<=COUNTIF(RT,$G$7),INDEX(TBL_BYR!D:D,MATCH($G$7,TBL_BYR!G:G,0)+ROW()-5),\"\")","v":""},{"$f":"IF(COUNTA($A$4:A19)<=COUNTIF(RT,$G$7),INDEX(TBL_BYR!E:E,MATCH($G$7,TBL_BYR!G:G,0)+ROW()-5),\"\")","v":""}]
{"$rows_left_out":16}